[python] Ошибка при установке lxml



Answers

Это сработало для меня:

yum install libxslt-devel libxml2-devel
Question

это моя ошибка:

(mysite)zjm1126@zjm1126-G41MT-S2:~/zjm_test/mysite$ pip install lxml
Downloading/unpacking lxml
  Running setup.py egg_info for package lxml
    Building lxml version 2.3.
    Building without Cython.
    ERROR: /bin/sh: xslt-config: not found

    ** make sure the development packages of libxml2 and libxslt are installed **

    Using build configuration of libxslt
Installing collected packages: lxml
  Running setup.py install for lxml
    Building lxml version 2.3.
    Building without Cython.
    ERROR: /bin/sh: xslt-config: not found

    ** make sure the development packages of libxml2 and libxslt are installed **

    Using build configuration of libxslt
    building 'lxml.etree' extension
    gcc -pthread -fno-strict-aliasing -DNDEBUG -g -fwrapv -O2 -Wall -Wstrict-prototypes -fPIC -I/usr/include/python2.6 -c src/lxml/lxml.etree.c -o build/temp.linux-i686-2.6/src/lxml/lxml.etree.o -w
    src/lxml/lxml.etree.c:4: fatal error: Python.h: 没有那个文件或目录
    compilation terminated.
    error: command 'gcc' failed with exit status 1
    Complete output from command /home/zjm1126/zjm_test/mysite/bin/python -c "import setuptools;__file__='/home/zjm1126/zjm_test/mysite/build/lxml/setup.py';execfile(__file__)" install --single-version-externally-managed --record /tmp/pip-jOhgvD-record/install-record.txt --install-headers /home/zjm1126/zjm_test/mysite/include/site/python2.6:
    Building lxml version 2.3.

Building without Cython.

ERROR: /bin/sh: xslt-config: not found



** make sure the development packages of libxml2 and libxslt are installed **



Using build configuration of libxslt

running install

running build

running build_py

running build_ext

building 'lxml.etree' extension

gcc -pthread -fno-strict-aliasing -DNDEBUG -g -fwrapv -O2 -Wall -Wstrict-prototypes -fPIC -I/usr/include/python2.6 -c src/lxml/lxml.etree.c -o build/temp.linux-i686-2.6/src/lxml/lxml.etree.o -w

src/lxml/lxml.etree.c:4: fatal error: Python.h: 没有那个文件或目录

compilation terminated.

error: command 'gcc' failed with exit status 1

----------------------------------------
Command /home/zjm1126/zjm_test/mysite/bin/python -c "import setuptools;__file__='/home/zjm1126/zjm_test/mysite/build/lxml/setup.py';execfile(__file__)" install --single-version-externally-managed --record /tmp/pip-jOhgvD-record/install-record.txt --install-headers /home/zjm1126/zjm_test/mysite/include/site/python2.6 failed with error code 1
Storing complete log in /home/zjm1126/.pip/pip.log

Что я могу сделать?

обновлено:

(mysite)zjm1126@zjm1126-G41MT-S2:~/zjm_test/mysite$ pip install lxml
Downloading/unpacking lxml
  Running setup.py egg_info for package lxml
    Building lxml version 2.3.
    Building without Cython.
    Using build configuration of libxslt 1.1.26
    Building against libxml2/libxslt in the following directory: /usr/lib
Installing collected packages: lxml
  Running setup.py install for lxml
    Building lxml version 2.3.
    Building without Cython.
    Using build configuration of libxslt 1.1.26
    Building against libxml2/libxslt in the following directory: /usr/lib
    building 'lxml.etree' extension
    gcc -pthread -fno-strict-aliasing -DNDEBUG -g -fwrapv -O2 -Wall -Wstrict-prototypes -fPIC -I/usr/include/libxml2 -I/usr/include/python2.6 -c src/lxml/lxml.etree.c -o build/temp.linux-i686-2.6/src/lxml/lxml.etree.o -w
    src/lxml/lxml.etree.c:4: fatal error: Python.h: 没有那个文件或目录
    compilation terminated.
    error: command 'gcc' failed with exit status 1
    Complete output from command /home/zjm1126/zjm_test/mysite/bin/python -c "import setuptools;__file__='/home/zjm1126/zjm_test/mysite/build/lxml/setup.py';execfile(__file__)" install --single-version-externally-managed --record /tmp/pip-NJw2ws-record/install-record.txt --install-headers /home/zjm1126/zjm_test/mysite/include/site/python2.6:
    Building lxml version 2.3.

Building without Cython.

Using build configuration of libxslt 1.1.26

Building against libxml2/libxslt in the following directory: /usr/lib

running install

running build

running build_py

running build_ext

building 'lxml.etree' extension

gcc -pthread -fno-strict-aliasing -DNDEBUG -g -fwrapv -O2 -Wall -Wstrict-prototypes -fPIC -I/usr/include/libxml2 -I/usr/include/python2.6 -c src/lxml/lxml.etree.c -o build/temp.linux-i686-2.6/src/lxml/lxml.etree.o -w

src/lxml/lxml.etree.c:4: fatal error: Python.h: 没有那个文件或目录

compilation terminated.

error: command 'gcc' failed with exit status 1

----------------------------------------
Command /home/zjm1126/zjm_test/mysite/bin/python -c "import setuptools;__file__='/home/zjm1126/zjm_test/mysite/build/lxml/setup.py';execfile(__file__)" install --single-version-externally-managed --record /tmp/pip-NJw2ws-record/install-record.txt --install-headers /home/zjm1126/zjm_test/mysite/include/site/python2.6 failed with error code 1
Storing complete log in /home/zjm1126/.pip/pip.log

журнал:

------------------------------------------------------------
/home/zjm1126/zjm_test/mysite/bin/pip run on Thu Mar  3 17:07:27 2011
Downloading/unpacking mysql-python
  Running setup.py egg_info for package mysql-python
    running egg_info
    creating pip-egg-info/MySQL_python.egg-info
    writing pip-egg-info/MySQL_python.egg-info/PKG-INFO
    writing top-level names to pip-egg-info/MySQL_python.egg-info/top_level.txt
    writing dependency_links to pip-egg-info/MySQL_python.egg-info/dependency_links.txt
    writing pip-egg-info/MySQL_python.egg-info/PKG-INFO
    writing top-level names to pip-egg-info/MySQL_python.egg-info/top_level.txt
    writing dependency_links to pip-egg-info/MySQL_python.egg-info/dependency_links.txt
    writing manifest file 'pip-egg-info/MySQL_python.egg-info/SOURCES.txt'
    warning: manifest_maker: standard file '-c' not found
    reading manifest file 'pip-egg-info/MySQL_python.egg-info/SOURCES.txt'
    reading manifest template 'MANIFEST.in'
    warning: no files found matching 'MANIFEST'
    warning: no files found matching 'ChangeLog'
    warning: no files found matching 'GPL'
    writing manifest file 'pip-egg-info/MySQL_python.egg-info/SOURCES.txt'
Installing collected packages: mysql-python
  Running setup.py install for mysql-python
    Running command /home/zjm1126/zjm_test/mysite/bin/python -c "import setuptools;__file__='/home/zjm1126/zjm_test/mysite/build/mysql-python/setup.py';execfile(__file__)" install --single-version-externally-managed --record /tmp/pip-XuVIux-record/install-record.txt --install-headers /home/zjm1126/zjm_test/mysite/include/site/python2.6
    running install
    running build
    running build_py
    creating build
    creating build/lib.linux-i686-2.6
    copying _mysql_exceptions.py -> build/lib.linux-i686-2.6
    creating build/lib.linux-i686-2.6/MySQLdb
    copying MySQLdb/__init__.py -> build/lib.linux-i686-2.6/MySQLdb
    copying MySQLdb/converters.py -> build/lib.linux-i686-2.6/MySQLdb
    copying MySQLdb/connections.py -> build/lib.linux-i686-2.6/MySQLdb
    copying MySQLdb/cursors.py -> build/lib.linux-i686-2.6/MySQLdb
    copying MySQLdb/release.py -> build/lib.linux-i686-2.6/MySQLdb
    copying MySQLdb/times.py -> build/lib.linux-i686-2.6/MySQLdb
    creating build/lib.linux-i686-2.6/MySQLdb/constants
    copying MySQLdb/constants/__init__.py -> build/lib.linux-i686-2.6/MySQLdb/constants
    copying MySQLdb/constants/CR.py -> build/lib.linux-i686-2.6/MySQLdb/constants
    copying MySQLdb/constants/FIELD_TYPE.py -> build/lib.linux-i686-2.6/MySQLdb/constants
    copying MySQLdb/constants/ER.py -> build/lib.linux-i686-2.6/MySQLdb/constants
    copying MySQLdb/constants/FLAG.py -> build/lib.linux-i686-2.6/MySQLdb/constants
    copying MySQLdb/constants/REFRESH.py -> build/lib.linux-i686-2.6/MySQLdb/constants
    copying MySQLdb/constants/CLIENT.py -> build/lib.linux-i686-2.6/MySQLdb/constants
    running build_ext
    building '_mysql' extension
    creating build/temp.linux-i686-2.6
    gcc -pthread -fno-strict-aliasing -DNDEBUG -g -fwrapv -O2 -Wall -Wstrict-prototypes -fPIC -Dversion_info=(1,2,3,'final',0) -D__version__=1.2.3 -I/usr/include/mysql -I/usr/include/python2.6 -c _mysql.c -o build/temp.linux-i686-2.6/_mysql.o -DBIG_JOINS=1 -fno-strict-aliasing -DUNIV_LINUX -DUNIV_LINUX
    In file included from _mysql.c:29:
    pymemcompat.h:10: fatal error: Python.h: 没有那个文件或目录
    compilation terminated.
    error: command 'gcc' failed with exit status 1
    Complete output from command /home/zjm1126/zjm_test/mysite/bin/python -c "import setuptools;__file__='/home/zjm1126/zjm_test/mysite/build/mysql-python/setup.py';execfile(__file__)" install --single-version-externally-managed --record /tmp/pip-XuVIux-record/install-record.txt --install-headers /home/zjm1126/zjm_test/mysite/include/site/python2.6:
    running install

running build

running build_py

creating build

creating build/lib.linux-i686-2.6

copying _mysql_exceptions.py -> build/lib.linux-i686-2.6

creating build/lib.linux-i686-2.6/MySQLdb

copying MySQLdb/__init__.py -> build/lib.linux-i686-2.6/MySQLdb

copying MySQLdb/converters.py -> build/lib.linux-i686-2.6/MySQLdb

copying MySQLdb/connections.py -> build/lib.linux-i686-2.6/MySQLdb

copying MySQLdb/cursors.py -> build/lib.linux-i686-2.6/MySQLdb

copying MySQLdb/release.py -> build/lib.linux-i686-2.6/MySQLdb

copying MySQLdb/times.py -> build/lib.linux-i686-2.6/MySQLdb

creating build/lib.linux-i686-2.6/MySQLdb/constants

copying MySQLdb/constants/__init__.py -> build/lib.linux-i686-2.6/MySQLdb/constants

copying MySQLdb/constants/CR.py -> build/lib.linux-i686-2.6/MySQLdb/constants

copying MySQLdb/constants/FIELD_TYPE.py -> build/lib.linux-i686-2.6/MySQLdb/constants

copying MySQLdb/constants/ER.py -> build/lib.linux-i686-2.6/MySQLdb/constants

copying MySQLdb/constants/FLAG.py -> build/lib.linux-i686-2.6/MySQLdb/constants

copying MySQLdb/constants/REFRESH.py -> build/lib.linux-i686-2.6/MySQLdb/constants

copying MySQLdb/constants/CLIENT.py -> build/lib.linux-i686-2.6/MySQLdb/constants

running build_ext

building '_mysql' extension

creating build/temp.linux-i686-2.6

gcc -pthread -fno-strict-aliasing -DNDEBUG -g -fwrapv -O2 -Wall -Wstrict-prototypes -fPIC -Dversion_info=(1,2,3,'final',0) -D__version__=1.2.3 -I/usr/include/mysql -I/usr/include/python2.6 -c _mysql.c -o build/temp.linux-i686-2.6/_mysql.o -DBIG_JOINS=1 -fno-strict-aliasing -DUNIV_LINUX -DUNIV_LINUX

In file included from _mysql.c:29:

pymemcompat.h:10: fatal error: Python.h: 没有那个文件或目录

compilation terminated.

error: command 'gcc' failed with exit status 1

----------------------------------------
Command /home/zjm1126/zjm_test/mysite/bin/python -c "import setuptools;__file__='/home/zjm1126/zjm_test/mysite/build/mysql-python/setup.py';execfile(__file__)" install --single-version-externally-managed --record /tmp/pip-XuVIux-record/install-record.txt --install-headers /home/zjm1126/zjm_test/mysite/include/site/python2.6 failed with error code 1
Exception information:
Traceback (most recent call last):
  File "/home/zjm1126/zjm_test/mysite/lib/python2.6/site-packages/pip-0.8.1-py2.6.egg/pip/basecommand.py", line 130, in main
    self.run(options, args)
  File "/home/zjm1126/zjm_test/mysite/lib/python2.6/site-packages/pip-0.8.1-py2.6.egg/pip/commands/install.py", line 228, in run
    requirement_set.install(install_options, global_options)
  File "/home/zjm1126/zjm_test/mysite/lib/python2.6/site-packages/pip-0.8.1-py2.6.egg/pip/req.py", line 1043, in install
    requirement.install(install_options, global_options)
  File "/home/zjm1126/zjm_test/mysite/lib/python2.6/site-packages/pip-0.8.1-py2.6.egg/pip/req.py", line 559, in install
    cwd=self.source_dir, filter_stdout=self._filter_install, show_stdout=False)
  File "/home/zjm1126/zjm_test/mysite/lib/python2.6/site-packages/pip-0.8.1-py2.6.egg/pip/__init__.py", line 249, in call_subprocess
    % (command_desc, proc.returncode))
InstallationError: Command /home/zjm1126/zjm_test/mysite/bin/python -c "import setuptools;__file__='/home/zjm1126/zjm_test/mysite/build/mysql-python/setup.py';execfile(__file__)" install --single-version-externally-managed --record /tmp/pip-XuVIux-record/install-record.txt --install-headers /home/zjm1126/zjm_test/mysite/include/site/python2.6 failed with error code 1



Я знаю, что опаздываю на шоу,

Но это поможет, если ничего не получится

mkdir ~/tmp
export TMPDIR=~/tmp
STATIC_DEPS=true easy_install-2.7 lxml

Установка TMPDIR гарантирует, что сборка может запускать все, что нужно для запуска, и установка STATIC_DEPS подскажет, что она будет использовать собственные libxml2 и libxslt2 вместо использования старых версий, установленных на сервере.




Если вы установили libxml2 и libxslt, возможно, вам нужно создать символическую ссылку между libxml2 и libxslt, чтобы путь к python2.6 включал путь. Также вы можете попробовать добавить аргумент среды INCLUDE. Поскольку команда gcc выполняет поиск только по этому пути: -I / usr / include / python2.6.




STATIC_DEPS=true easy_install lxml



Используя Windows 7 с Cygwin, я наткнулся:

Compile failed: command 'gcc' failed with exit status 1
cc -I/usr/include/libxml2 -I/usr/include/libxml2 -c /tmp/xmlXPathInitZsgdMQ.c -o tmp/xmlXPathInitZsgdMQ.o
*********************************************************************************
Could not find function xmlCheckVersion in library libxml2. Is libxml2 installed?
*********************************************************************************
error: command 'gcc' failed with exit status 1

Я исправил его, установив mingw64-x86_64-libxslt




В Windows у меня была такая же ошибка в Windows при попытке вручную установить в Python 3.4 после того, как она была установлена ​​на 3.3. Я, наконец, смог его решить, установив колесо и запустив pip из каталога Python34.

1) скачать колесо отсюда: http://www.lfd.uci.edu/~gohlke/pythonlibs/#lxml

2) cd Python34\Scripts

3) pip.exe C:\Users\Home\Downloads\lxml- ......... .whl




error: command 'gcc' failed with exit status 1

yum remove audit
yum install gcc
yum install libxslt-devel libxml2-devel

cd lxml-x.x.x
python setup.py build
python setup.py install



Использование cygwin 64 с Windows 8.

У меня есть...

pip install lxml (...)

gcc -DNDEBUG -g -fwrapv -O3 -Wall -Wstrict-prototypes -ggdb -O2 -pipe -Wimplicit-function-declaration -fdebug-prefix-map=/usr/src/ports/python3/python3-3.2.5-4.x86_64/build=/usr/src/debug/python3-3.2.5-4 -fdebug-prefix-map=/usr/src/ports/python3/python3-3.2.5-4.x86_64/src/Python-3.2.5=/usr/src/debug/python3-3.2.5-4 -I/usr/include/libxml2 -I/tmp/pip-build-b8ybku/lxml/src/lxml/includes -I/usr/include/python3.2m -c src/lxml/lxml.etree.c -o build/temp.cygwin-1.7.34-x86_64-3.2/src/lxml/lxml.etree.o -w

src/lxml/lxml.etree.c:8:22: fatal error: pyconfig.h: No such file or directory

compilation terminated.

/usr/lib/python3.2/distutils/dist.py:257: UserWarning: Unknown distribution option: 'bugtrack_url'

  warnings.warn(msg)

error: command 'gcc' failed with exit status 1

----------------------------------------
Command "/usr/bin/python3.2m -c "import setuptools, tokenize;__file__='/tmp/pip-build-b8ybku/lxml/setup.py';exec(compile(getattr(tokenize, 'open', open)(__file__).read().replace('\r\n', '\n'), __file__, 'exec'))" install --record /tmp/pip-u3vwj8-record/install-record.txt --single-version-externally-managed --compile" failed with error code 1 in /tmp/pip-build-b8ybku/lxml

Я пробовал все, пока не понял, что новая инструментальная цепочка cygwin испортила логику python. cygwin устанавливает компилятор под названием «realgcc», который не является реальным gcc.

Решение

Установите gcc. Пример:

 apt-cyg install gcc-g++



Все приведенные выше ответы предполагают, что у пользователя есть доступ к привилегированной / корневой учетной записи для установки необходимых библиотек. Чтобы установить его локально, вам необходимо выполнить следующие шаги. Только показал обзор, поскольку этапы могут быть немного задействованы в зависимости от зависимостей, которые могут отсутствовать

1.Загрузить и скомпилировать libxml2-2.9.1 и libxslt-1.1.28 (версии могут измениться)

2. Конфигурируйте каждый путь установки как для libxml, так и для libxslt как локальный каталог с помощью configure. Ex. ./configure --prefix=/home_dir/dependencies/libxslt_path

3. Запустите make make install

4.Загрузить и скомпилировать lxml из источника




Я получил ту же ошибку на моей машине Linux. Если вы заходите на их website который также находится в их документации. Так что, если вы получаете такую ​​ошибку на машине Linux , попробуйте эти команды,

# apt install libxml2-dev libxslt-dev python-dev

# pip install lxml==3.4.4




У меня возникла проблема с установкой lxml. Мой экземпляр CentOS использовал python 2.6, который выбрасывал эту ошибку.

Чтобы обойти это, я сделал следующее для работы с Python 2.7:

  1. Запуск: sudo yum install python-devel
  2. Запустить sudo yum install libxslt-devel libxml2-devel
  3. Используйте Python 2.7 для запуска вашей команды с помощью /usr/bin/python2.7 YOUR_PYTHON_COMMAND (для меня это было /usr/bin/python2.7 -m pip install lxml )



Нет, вам не хватает файлов заголовков Python. В основном это происходит в Linux, когда вы используете систему Python (есть причины не делать этого , но это другой вопрос).

Вероятно, вам нужно установить какой-то пакет, и он, вероятно, называется python-dev или python-devel.

 sudo yum install python-devel

или

 sudo aptitude install python-dev

Или немного.




В osx 10.10.5 и в virtualenv, возможно, вы можете решить эту проблему, как показано ниже:

sudo C_INCLUDE_PATH=/Applications/Xcode.app/Contents/Developer/Platforms/MacOSX.platform/Developer/SDKs/MacOSX10.11.sdk/usr/include/libxml2:/Applications/Xcode.app/Contents/Developer/Platforms/MacOSX.platform/Developer/SDKs/MacOSX10.11.sdk/usr/include/libxml2/libxml:/Applications/Xcode.app/Contents/Developer/Platforms/MacOSX.platform/Developer/SDKs/MacOSX10.11.sdk/usr/include pip install -r lxml



Related