react-native - unable - react native react transform hmr




React Nativeのアップグレード後に「verifyReleaseResources」エラーが発生する (2)

エラーの原因:

あなたは依存関係としてreact-native-document-pickerをインストールしました、そして、このエラーの理由はあなたのandroid/app/build.gradlenode_modules/react-native-document-picker/android/build.gradle不一致です。 。

溶液

  1. node_modules/react-native-document-picker/android/build.gradle
  2. compileSdkVersion buildToolsVersion minSdkVersion targetSdkVersion編集し、 android/app/build.gradleと同じにします。
  3. プロジェクトをもう一度同期します。
  4. ターミナルから./gradlew assembleReleaseを実行します。

アプリケーションをReact Native 0.57.1​​にアップグレードしようとしています。 すべての手順を実行し、適切なファイルをすべてアップグレードしたにもかかわらず、まだ理解できないエラーが発生しています。

:react-native-document-picker:compileReleaseSources UP-TO-DATE
:react-native-document-picker:mergeReleaseResources UP-TO-DATE
:react-native-document-picker:verifyReleaseResourcesC:\Users\USERNAME\.gradle\caches\transforms-1\files-1.1\appcompat-v7-27.1.1.aar\b3b5480809d523e6f8b8de92faafbcda\res\values-v26\values-v26.xml:9:5-12:13: AAPT: error: resource android:attr/colorError not found.

C:\Users\USERNAME\.gradle\caches\transforms-1\files-1.1\appcompat-v7-27.1.1.aar\b3b5480809d523e6f8b8de92faafbcda\res\values-v26\values-v26.xml:13:5-16:13: AAPT: error: resource android:attr/colorError not found.

C:\Users\USERNAME\.gradle\caches\transforms-1\files-1.1\appcompat-v7-27.1.1.aar\b3b5480809d523e6f8b8de92faafbcda\res\values-v26\values-v26.xml:17:5-93: AAPT: error: style attribute 'android:attr/keyboardNavigationCluster' not found.

C:\Users\USERNAME\.gradle\caches\transforms-1\files-1.1\appcompat-v7-27.1.1.aar\b3b5480809d523e6f8b8de92faafbcda\res\values\values.xml:251:5-69: AAPT: error: resource android:attr/fontStyle not found.

C:\Users\USERNAME\.gradle\caches\transforms-1\files-1.1\appcompat-v7-27.1.1.aar\b3b5480809d523e6f8b8de92faafbcda\res\values\values.xml:251:5-69: AAPT: error: resource android:attr/font not found.

C:\Users\USERNAME\.gradle\caches\transforms-1\files-1.1\appcompat-v7-27.1.1.aar\b3b5480809d523e6f8b8de92faafbcda\res\values\values.xml:251:5-69: AAPT: error: resource android:attr/fontWeight not found.


error: failed linking references.
:react-native-document-picker:verifyReleaseResources FAILED

FAILURE: Build failed with an exception.

* What went wrong:
Execution failed for task ':react-native-document-picker:verifyReleaseResources'.
> com.android.ide.common.process.ProcessException: Failed to execute aapt

私は実際にこれらのエラーを理解することはできません。 どうやってこれを直すことができますか?

.cacheディレクトリを削除したり、gradleのバージョンを変更したりするなど、さまざまなことを試してみましたが、何も役に立たないようです。 何か案が?


プロジェクトのandroid / build.gradleに次のコードを追加する必要があります。

subprojects {
    afterEvaluate {project ->
        if (project.hasProperty("android")) {
            android {
                compileSdkVersion 27
                buildToolsVersion "27.0.2"
            }
        }
    }
}




react-native-android