transformclasseswithprejackpackagedlibrariesfordebug - webrtcmodule compilereleasejavawithjavac failed




Не удалось выполнить задачу: app: compileDebugJavaWithJavac в Android Studio (18)

Обновление (05.06.2017)

Я хотел использовать Realm для Android, и это требовало Retrolambda . Проблема в том, что Ретроламбда конфликтует с Джеком.

Поэтому я удалил конфигурацию опций Jack из моего gradle, показанного в оригинальном ответе ниже, и внес следующие изменения:

// ---------------------------------------------
// Project build.gradle file
// ---------------------------------------------
buildscript {
    repositories {
        jcenter()
    }
    dependencies {
        classpath 'com.android.tools.build:gradle:2.3.1'
        classpath 'me.tatarka:gradle-retrolambda:3.6.1'
        classpath "io.realm:realm-gradle-plugin:3.1.4"

        // NOTE: Do not place your application dependencies here; they belong
        // in the individual module build.gradle files
    }
}

а также

// ---------------------------------------------
// Module build.gradle file
// ---------------------------------------------
apply plugin: 'com.android.application'
apply plugin: 'me.tatarka.retrolambda'
apply plugin: 'realm-android'

android {
    compileSdkVersion 25
    buildToolsVersion "25.0.2"
    ...

tools.jar

Если вы внесли эти изменения выше и по-прежнему получаете следующую ошибку:

Execution failed for task ':app:compileDebugJavaWithJavac'.
com.sun.tools.javac.util.Context.put(Ljava/lang/Class;Ljava/lang/Object;)V

Попробуйте удалить следующий файл:

/Library/Java/Extensions/tools.jar 

Затем:

  1. Выйти из эмулятора
  2. Выйти из Android Studio
  3. Откройте Android Studio
  4. Построить> Чистый проект
  5. Запустите / отладьте ваше приложение на вашем устройстве / эмуляторе снова

Все изменения исправили это для меня.

Примечание:

Я не уверен, что делает tools.jar или важно ли это. Как и другие применения в этом вопросе Stackoverflow:

Не могу собрать проект Java на OSX yosemite

Нам очень повезло, что нам пришлось использовать AUSKey (некоторую древнюю систему ключей аутентификации Java для динозавров, используемую правительством Австралии для аутентификации нашего компьютера, прежде чем мы сможем войти на веб-сайт австралийского бизнес-портала).

Мое предположение, tools.jar возможно, было файлом JAR для / от AUSKey.

Если вы беспокоитесь, вместо удаления этого файла вы можете сделать резервную копию всей папки и сохранить ее где-нибудь на случай, если не сможете снова войти в Австралийский бизнес-портал.

Надеюсь, что поможет: D

Оригинальный ответ

Я столкнулся с этой проблемой сегодня (27.06.2016).

Я скачал Android Studio 2.2 и обновил JDK до 1.8.

В дополнение к приведенным выше ответам, указывающим на правильный путь JDK, мне пришлось дополнительно указать версию JDK в моем build.gradle(Module: app) файле:

compileOptions {
    sourceCompatibility JavaVersion.VERSION_1_8
    targetCompatibility JavaVersion.VERSION_1_8
}

Полученный файл выглядит так:

apply plugin: 'com.android.application'

android {
    compileSdkVersion 24
    buildToolsVersion "24.0.2"
    defaultConfig {
        applicationId "com.mycompany.appname"
        minSdkVersion 17
        targetSdkVersion 24
        versionCode 1
        versionName "1.0"
        testInstrumentationRunner "android.support.test.runner.AndroidJUnitRunner"

        jackOptions {
            enabled true
        }
    }
    buildTypes {
        release {
            minifyEnabled false
            proguardFiles getDefaultProguardFile('proguard-android.txt'), 'proguard-rules.pro'
        }
    }
    compileOptions {
        sourceCompatibility JavaVersion.VERSION_1_8
        targetCompatibility JavaVersion.VERSION_1_8
    }
}

dependencies {
    compile fileTree(dir: 'libs', include: ['*.jar'])
    androidTestCompile('com.android.support.test.espresso:espresso-core:2.2.2', {
        exclude group: 'com.android.support', module: 'support-annotations'
    })
    compile 'com.android.support:appcompat-v7:24.2.1'
    testCompile 'junit:junit:4.12'
}

Также обратите внимание, что если вы столкнулись с ошибкой Java 8 language features requires Jack enabled , вам нужно добавить в свой файл Gradle следующее (как показано выше):

jackOptions {
    enabled true
}

После этого на моем телефоне наконец-то запустилось приложение нового проекта.

Я занимаюсь разработкой приложения для Android в Android Studio. Не совсем уверен, что пошло не так. Я успешно строил несколько дней назад. Любая помощь будет отличной.

Вот ошибка:

Error:Execution failed for task ':app:compileDebugJavaWithJavac'.
> Compilation failed; see the compiler error output for details.

* What went wrong:
Execution failed for task ':app:compileDebugJavaWithJavac'.
> Compilation failed; see the compiler error output for details.

Вот мой build.gradle

apply plugin: 'com.android.application'

android {
compileSdkVersion 23
buildToolsVersion "21.1.2"

defaultConfig {
    multiDexEnabled true
    applicationId "com.tubbs.citychurchob"
    minSdkVersion 14
    targetSdkVersion 23
    versionCode 1
    versionName "1.0"
}
buildTypes {
    release {
        minifyEnabled false
      proguardFiles getDefaultProguardFile('proguard-android.txt'),        'proguard-rules.pro'
    }
}
}

dependencies {
compile fileTree(dir: 'libs', include: ['*.jar'])
compile fileTree(dir: 'libs', include: 'Parse-*.jar')
compile 'com.android.support:appcompat-v7:23.1.0'
compile 'com.android.support:cardview-v7:23.1.0'
compile 'com.parse.bolts:bolts-android:1+'
compile 'com.android.support:recyclerview-v7:23.1.0'
}

1-й шаг:

2-й шаг:

Я пробую оба ответа, но ничего не получается. Я думаю, здесь есть решение.

Из вашего проекта

перейдите в Gradle Scripts >> build.gradle (Module: app), затем удалите приведенный ниже код (если существует)

.............................................

compileOptions {
    sourceCompatibility JavaVersion.VERSION_1_7
    targetCompatibility JavaVersion.VERSION_1_6
}

.............................................

удалите его и затем очистите проект, затем запустите. нет Java дома, чтобы установить, не нужно менять версию


В моем случае проблема не была решена путем обновления ножа

от: "com.jakewharton: butterknife: 8.4.0" до: "com.jakewharton: butterknife: 8.8.1"

Я пытался @BindView внутри класса адаптера, но безуспешно. Как только я использовал .findViewById (R.id.message_time), компиляция была успешно завершена.


Ваши файлы Gradle могут быть повреждены. Попробуйте запустить

./gradlew --refresh-dependencies

в терминале внутри андроид студии.


Изменение чего-либо в файле build.gradle снова синхронизирует все, и ошибка исчезнет. Для меня я изменил minSdkVersion, и это сработало. Не беспокойтесь, это может произойти, если система выйдет из строя или Android Studio не будет закрыта должным образом.


Используйте эти настройки, и все будет работать нормально.

android {
     compileSdkVersion 26
     buildToolsVersion '26.0.2'

  defaultConfig {
    applicationId "com.pm.motivator"
    minSdkVersion 15
    targetSdkVersion 26
    versionCode 1
    versionName "1.0"
 }
}

Проблема только в именовании папок, если ваша папка для сохранения вашего проекта содержит специальные символы, то удалите их. Если ошибка повторяется, попробуйте сохранить папку без пробелов.


Просто дополнил ответ @yuchaozh выше, что помогло мне решить его. (У меня нет представителя, чтобы комментировать)

Запустите это, чтобы узнать, какая у вас версия Java

ls /Library/Java/JavaVirtualMachines/

Вы получите вывод как:

jdk1.8.0_111.jdk

Замените его на версию Java и выполните эту команду, чтобы экспортировать правильный путь.

export JAVA_HOME="/Library/Java/JavaVirtualMachines/<YOUR_JAVA_VERSION>/Contents/Home"

У меня была такая же проблема. Я работал с командой разработчиков, использующих Mac, и все остальные в команде работали под Windows. Однако мы использовали Anroid Studio 2.2-beta с jdk 1.8. Если вы на Mac и столкнулись с этой проблемой, вот как ее решить. НЕ ИСПОЛЬЗУЙТЕ Android Studio 2.2-beta. Я часами пытался отладить эту ошибку в 2.2-бета. Я решил это, просто перейдя на Android Studio 2.1.3 . Наше приложение запустилось сразу после смены версии Android Studio. Также на веб-сайте Android Studio перед загрузкой он предупреждает пользователей Mac о запуске jdk 1.8 на 2.2 beta. Думаю, я должен был прочитать мелкий шрифт, ха-ха


У меня была эта ошибка, когда я пытался использовать retrolambda в своих модульных тестах. Я не нашел решения, как заставить retrolambda работать с юнит-тестами. Итак, я использую старомодные анонимные классы вместо лямбд в своих модульных тестах, и это работает для меня.


Установить местоположение JDK в настройках проекта


Это может произойти, если вы используете Android + Lambdas. Иногда я могу использовать Lambdas без каких-либо проблем, но в других ситуациях проект не компилируется и выдает исключение в компиляторе (когда я пытаюсь передать лямбда или ссылку на метод ScheduledExecutorService.scheduleAtFixedRate).

В этой ссылке есть обсуждение ( https://bugs.openjdk.java.net/browse/JDK-8169759 ), где объясняется, почему это происходит. В то же время я просто использую лямбды в своем проекте Android, когда мне позволяет компилятор.


Я столкнулся с подобной проблемой, но мне пришлось вручную установить папку jdk для файлов программы, поэтому я рекомендую всем, особенно тем, которые обновляются до java 8, указывать прямо в настройках проекта андроид-студии, либо используя embed вариант или выбор папки


Я столкнулся с той же ошибкой. JAVA_HOME указывает на правильную версию JDK. Все библиотеки поддержки и инструменты сборки обновлены. По-прежнему сталкивался с той же проблемой.

Я использую аннотации Android в своем проекте. Я добавил новый вид .. и уже существовал вид с таким же именем в файле Java. Когда я запускаю проект, вместо указания на то, что представление уже существует, я получаю вышеуказанную ошибку.

Проверьте ваши ошибки файлов Java, если другие решения не работают.


в файле компиляции изменить файлы компиляции ('AF-Android-SDK.jar') для компиляции файлов ('libs / AF-Android-SDK.jar') это будет работать


это работает для меня

compileSdkVersion 25
buildToolsVersion '25.0.0'

Попробуйте обновить свой buildToolsVersion до «23.0.1», например так:

compileSdkVersion 23
buildToolsVersion "23.0.1"

Если вы не установили buildTools для этой версии, пожалуйста, скачайте его с SDKManager в качестве подсказки.


Проблемы такого рода действительно вызывают у нас беспокойство, так как больше никакой полезной информации предоставлено не будет.

Я не знаю, что мы на самом деле одинаковы, но я могу предоставить два способа помочь нам решить проблему.

Во-первых, вы можете попытаться очистить или перезапустить вашу Android Studio и ваш компьютер. В Китае у нас есть поговорка между разработчиками.

Маленькие проблемы, просто перезагрузите компьютер. Большие проблемы, следует переустановить.

Вышеприведенное высказывание поможет вам решить эту проблему много раз.

2. Во-вторых, нам нужно использовать команду gradle, чтобы помочь вам найти более полезные детали.

Я встретил похожую ситуацию, как показано ниже:

org.gradle.initialization.ReportedException: org.gradle.internal.exceptions.LocationAwareException: Execution failed for task ':app:compileDebugJavaWithJavac'.
    at org.gradle.initialization.DefaultGradleLauncher.doBuildStages(DefaultGradleLauncher.java:139)
    at org.gradle.initialization.DefaultGradleLauncher.executeTasks(DefaultGradleLauncher.java:109)
    at org.gradle.internal.invocation.GradleBuildController$1.call(GradleBuildController.java:78)
    at org.gradle.internal.invocation.GradleBuildController$1.call(GradleBuildController.java:75)
    at org.gradle.internal.work.DefaultWorkerLeaseService.withLocks(DefaultWorkerLeaseService.java:152)
    at org.gradle.internal.invocation.GradleBuildController.doBuild(GradleBuildController.java:100)
    at org.gradle.internal.invocation.GradleBuildController.run(GradleBuildController.java:75)
    at org.gradle.tooling.internal.provider.runner.BuildModelActionRunner.run(BuildModelActionRunner.java:53)
    at org.gradle.launcher.exec.ChainingBuildActionRunner.run(ChainingBuildActionRunner.java:35)
    at org.gradle.launcher.exec.ChainingBuildActionRunner.run(ChainingBuildActionRunner.java:35)
    at org.gradle.tooling.internal.provider.ValidatingBuildActionRunner.run(ValidatingBuildActionRunner.java:32)
    at org.gradle.launcher.exec.RunAsBuildOperationBuildActionRunner$1.run(RunAsBuildOperationBuildActionRunner.java:43)
    at org.gradle.internal.progress.DefaultBuildOperationExecutor$RunnableBuildOperationWorker.execute(DefaultBuildOperationExecutor.java:336)
    at org.gradle.internal.progress.DefaultBuildOperationExecutor$RunnableBuildOperationWorker.execute(DefaultBuildOperationExecutor.java:328)
    at org.gradle.internal.progress.DefaultBuildOperationExecutor.execute(DefaultBuildOperationExecutor.java:199)
    at org.gradle.internal.progress.DefaultBuildOperationExecutor.run(DefaultBuildOperationExecutor.java:110)
    at org.gradle.launcher.exec.RunAsBuildOperationBuildActionRunner.run(RunAsBuildOperationBuildActionRunner.java:40)
    at org.gradle.tooling.internal.provider.SubscribableBuildActionRunner.run(SubscribableBuildActionRunner.java:51)
    at org.gradle.launcher.exec.InProcessBuildActionExecuter.execute(InProcessBuildActionExecuter.java:47)
    at org.gradle.launcher.exec.InProcessBuildActionExecuter.execute(InProcessBuildActionExecuter.java:30)
    at org.gradle.launcher.exec.BuildTreeScopeBuildActionExecuter.execute(BuildTreeScopeBuildActionExecuter.java:39)
    at org.gradle.launcher.exec.BuildTreeScopeBuildActionExecuter.execute(BuildTreeScopeBuildActionExecuter.java:25)
    at org.gradle.tooling.internal.provider.ContinuousBuildActionExecuter.execute(ContinuousBuildActionExecuter.java:80)
    at org.gradle.tooling.internal.provider.ContinuousBuildActionExecuter.execute(ContinuousBuildActionExecuter.java:53)
    at org.gradle.tooling.internal.provider.ServicesSetupBuildActionExecuter.execute(ServicesSetupBuildActionExecuter.java:57)
    at org.gradle.tooling.internal.provider.ServicesSetupBuildActionExecuter.execute(ServicesSetupBuildActionExecuter.java:32)
    at org.gradle.tooling.internal.provider.GradleThreadBuildActionExecuter.execute(GradleThreadBuildActionExecuter.java:36)
    at org.gradle.tooling.internal.provider.GradleThreadBuildActionExecuter.execute(GradleThreadBuildActionExecuter.java:25)
    at org.gradle.tooling.internal.provider.ParallelismConfigurationBuildActionExecuter.execute(ParallelismConfigurationBuildActionExecuter.java:43)
    at org.gradle.tooling.internal.provider.ParallelismConfigurationBuildActionExecuter.execute(ParallelismConfigurationBuildActionExecuter.java:29)
    at org.gradle.tooling.internal.provider.StartParamsValidatingActionExecuter.execute(StartParamsValidatingActionExecuter.java:69)
    at org.gradle.tooling.internal.provider.StartParamsValidatingActionExecuter.execute(StartParamsValidatingActionExecuter.java:30)
    at org.gradle.tooling.internal.provider.SessionFailureReportingActionExecuter.execute(SessionFailureReportingActionExecuter.java:59)
    at org.gradle.tooling.internal.provider.SessionFailureReportingActionExecuter.execute(SessionFailureReportingActionExecuter.java:44)
    at org.gradle.tooling.internal.provider.SetupLoggingActionExecuter.execute(SetupLoggingActionExecuter.java:45)
    at org.gradle.tooling.internal.provider.SetupLoggingActionExecuter.execute(SetupLoggingActionExecuter.java:30)
    at org.gradle.launcher.daemon.server.exec.ExecuteBuild.doBuild(ExecuteBuild.java:67)
    at org.gradle.launcher.daemon.server.exec.BuildCommandOnly.execute(BuildCommandOnly.java:36)
    at org.gradle.launcher.daemon.server.api.DaemonCommandExecution.proceed(DaemonCommandExecution.java:122)
    at org.gradle.launcher.daemon.server.exec.WatchForDisconnection.execute(WatchForDisconnection.java:37)
    at org.gradle.launcher.daemon.server.api.DaemonCommandExecution.proceed(DaemonCommandExecution.java:122)
    at org.gradle.launcher.daemon.server.exec.ResetDeprecationLogger.execute(ResetDeprecationLogger.java:26)
    at org.gradle.launcher.daemon.server.api.DaemonCommandExecution.proceed(DaemonCommandExecution.java:122)
    at org.gradle.launcher.daemon.server.exec.RequestStopIfSingleUsedDaemon.execute(RequestStopIfSingleUsedDaemon.java:34)
    at org.gradle.launcher.daemon.server.api.DaemonCommandExecution.proceed(DaemonCommandExecution.java:122)
    at org.gradle.launcher.daemon.server.exec.ForwardClientInput$2.call(ForwardClientInput.java:74)
    at org.gradle.launcher.daemon.server.exec.ForwardClientInput$2.call(ForwardClientInput.java:72)
    at org.gradle.util.Swapper.swap(Swapper.java:38)
    at org.gradle.launcher.daemon.server.exec.ForwardClientInput.execute(ForwardClientInput.java:72)
    at org.gradle.launcher.daemon.server.api.DaemonCommandExecution.proceed(DaemonCommandExecution.java:122)
    at org.gradle.launcher.daemon.server.exec.LogAndCheckHealth.execute(LogAndCheckHealth.java:55)
    at org.gradle.launcher.daemon.server.api.DaemonCommandExecution.proceed(DaemonCommandExecution.java:122)
    at org.gradle.launcher.daemon.server.exec.LogToClient.doBuild(LogToClient.java:62)
    at org.gradle.launcher.daemon.server.exec.BuildCommandOnly.execute(BuildCommandOnly.java:36)
    at org.gradle.launcher.daemon.server.api.DaemonCommandExecution.proceed(DaemonCommandExecution.java:122)
    at org.gradle.launcher.daemon.server.exec.EstablishBuildEnvironment.doBuild(EstablishBuildEnvironment.java:82)
    at org.gradle.launcher.daemon.server.exec.BuildCommandOnly.execute(BuildCommandOnly.java:36)
    at org.gradle.launcher.daemon.server.api.DaemonCommandExecution.proceed(DaemonCommandExecution.java:122)
    at org.gradle.launcher.daemon.server.exec.StartBuildOrRespondWithBusy$1.run(StartBuildOrRespondWithBusy.java:50)
    at org.gradle.launcher.daemon.server.DaemonStateCoordinator$1.run(DaemonStateCoordinator.java:295)
    at org.gradle.internal.concurrent.ExecutorPolicy$CatchAndRecordFailures.onExecute(ExecutorPolicy.java:63)
    at org.gradle.internal.concurrent.ManagedExecutorImpl$1.run(ManagedExecutorImpl.java:46)
    at java.util.concurrent.ThreadPoolExecutor.runWorker(ThreadPoolExecutor.java:1142)
    at java.util.concurrent.ThreadPoolExecutor$Worker.run(ThreadPoolExecutor.java:617)
    at org.gradle.internal.concurrent.ThreadFactoryImpl$ManagedThreadRunnable.run(ThreadFactoryImpl.java:55)
    at java.lang.Thread.run(Thread.java:745)
Caused by: org.gradle.internal.exceptions.LocationAwareException: Execution failed for task ':app:compileDebugJavaWithJavac'.
    at org.gradle.initialization.DefaultExceptionAnalyser.transform(DefaultExceptionAnalyser.java:74)
    at org.gradle.initialization.MultipleBuildFailuresExceptionAnalyser.transform(MultipleBuildFailuresExceptionAnalyser.java:47)
    at org.gradle.initialization.StackTraceSanitizingExceptionAnalyser.transform(StackTraceSanitizingExceptionAnalyser.java:30)
    at org.gradle.initialization.DefaultGradleLauncher.doBuildStages(DefaultGradleLauncher.java:137)
    at org.gradle.initialization.DefaultGradleLauncher.executeTasks(DefaultGradleLauncher.java:109)
    at org.gradle.internal.invocation.GradleBuildController$1.call(GradleBuildController.java:78)
    at org.gradle.internal.invocation.GradleBuildController$1.call(GradleBuildController.java:75)
    at org.gradle.internal.work.DefaultWorkerLeaseService.withLocks(DefaultWorkerLeaseService.java:152)
    at org.gradle.internal.invocation.GradleBuildController.doBuild(GradleBuildController.java:100)
    at org.gradle.internal.invocation.GradleBuildController.run(GradleBuildController.java:75)
    at org.gradle.tooling.internal.provider.runner.BuildModelActionRunner.run(BuildModelActionRunner.java:53)
    at org.gradle.launcher.exec.ChainingBuildActionRunner.run(ChainingBuildActionRunner.java:35)
    at org.gradle.launcher.exec.ChainingBuildActionRunner.run(ChainingBuildActionRunner.java:35)
    at org.gradle.tooling.internal.provider.ValidatingBuildActionRunner.run(ValidatingBuildActionRunner.java:32)
    at org.gradle.launcher.exec.RunAsBuildOperationBuildActionRunner$1.run(RunAsBuildOperationBuildActionRunner.java:43)
    at org.gradle.internal.progress.DefaultBuildOperationExecutor$RunnableBuildOperationWorker.execute(DefaultBuildOperationExecutor.java:336)
    at org.gradle.internal.progress.DefaultBuildOperationExecutor$RunnableBuildOperationWorker.execute(DefaultBuildOperationExecutor.java:328)
    at org.gradle.internal.progress.DefaultBuildOperationExecutor.execute(DefaultBuildOperationExecutor.java:199)
    at org.gradle.internal.progress.DefaultBuildOperationExecutor.run(DefaultBuildOperationExecutor.java:110)
    at org.gradle.launcher.exec.RunAsBuildOperationBuildActionRunner.run(RunAsBuildOperationBuildActionRunner.java:40)
    at org.gradle.tooling.internal.provider.SubscribableBuildActionRunner.run(SubscribableBuildActionRunner.java:51)
    at org.gradle.launcher.exec.InProcessBuildActionExecuter.execute(InProcessBuildActionExecuter.java:47)
    at org.gradle.launcher.exec.InProcessBuildActionExecuter.execute(InProcessBuildActionExecuter.java:30)
    at org.gradle.launcher.exec.BuildTreeScopeBuildActionExecuter.execute(BuildTreeScopeBuildActionExecuter.java:39)
    at org.gradle.launcher.exec.BuildTreeScopeBuildActionExecuter.execute(BuildTreeScopeBuildActionExecuter.java:25)
    at org.gradle.tooling.internal.provider.ContinuousBuildActionExecuter.execute(ContinuousBuildActionExecuter.java:80)
    at org.gradle.tooling.internal.provider.ContinuousBuildActionExecuter.execute(ContinuousBuildActionExecuter.java:53)
    at org.gradle.tooling.internal.provider.ServicesSetupBuildActionExecuter.execute(ServicesSetupBuildActionExecuter.java:57)
    at org.gradle.tooling.internal.provider.ServicesSetupBuildActionExecuter.execute(ServicesSetupBuildActionExecuter.java:32)
    at org.gradle.tooling.internal.provider.GradleThreadBuildActionExecuter.execute(GradleThreadBuildActionExecuter.java:36)
    at org.gradle.tooling.internal.provider.GradleThreadBuildActionExecuter.execute(GradleThreadBuildActionExecuter.java:25)
    at org.gradle.tooling.internal.provider.ParallelismConfigurationBuildActionExecuter.execute(ParallelismConfigurationBuildActionExecuter.java:43)
    at org.gradle.tooling.internal.provider.ParallelismConfigurationBuildActionExecuter.execute(ParallelismConfigurationBuildActionExecuter.java:29)
    at org.gradle.tooling.internal.provider.StartParamsValidatingActionExecuter.execute(StartParamsValidatingActionExecuter.java:69)
    at org.gradle.tooling.internal.provider.StartParamsValidatingActionExecuter.execute(StartParamsValidatingActionExecuter.java:30)
    at org.gradle.tooling.internal.provider.SessionFailureReportingActionExecuter.execute(SessionFailureReportingActionExecuter.java:59)
    at org.gradle.tooling.internal.provider.SessionFailureReportingActionExecuter.execute(SessionFailureReportingActionExecuter.java:44)
    at org.gradle.tooling.internal.provider.SetupLoggingActionExecuter.execute(SetupLoggingActionExecuter.java:45)
    at org.gradle.tooling.internal.provider.SetupLoggingActionExecuter.execute(SetupLoggingActionExecuter.java:30)
    at org.gradle.launcher.daemon.server.exec.ExecuteBuild.doBuild(ExecuteBuild.java:67)
    at org.gradle.launcher.daemon.server.exec.BuildCommandOnly.execute(BuildCommandOnly.java:36)
    at org.gradle.launcher.daemon.server.api.DaemonCommandExecution.proceed(DaemonCommandExecution.java:122)
    at org.gradle.launcher.daemon.server.exec.WatchForDisconnection.execute(WatchForDisconnection.java:37)
    at org.gradle.launcher.daemon.server.api.DaemonCommandExecution.proceed(DaemonCommandExecution.java:122)
    at org.gradle.launcher.daemon.server.exec.ResetDeprecationLogger.execute(ResetDeprecationLogger.java:26)
    at org.gradle.launcher.daemon.server.api.DaemonCommandExecution.proceed(DaemonCommandExecution.java:122)
    at org.gradle.launcher.daemon.server.exec.RequestStopIfSingleUsedDaemon.execute(RequestStopIfSingleUsedDaemon.java:34)
    at org.gradle.launcher.daemon.server.api.DaemonCommandExecution.proceed(DaemonCommandExecution.java:122)
    at org.gradle.launcher.daemon.server.exec.ForwardClientInput$2.call(ForwardClientInput.java:74)
    at org.gradle.launcher.daemon.server.exec.ForwardClientInput$2.call(ForwardClientInput.java:72)
    at org.gradle.util.Swapper.swap(Swapper.java:38)
    at org.gradle.launcher.daemon.server.exec.ForwardClientInput.execute(ForwardClientInput.java:72)
    at org.gradle.launcher.daemon.server.api.DaemonCommandExecution.proceed(DaemonCommandExecution.java:122)
    at org.gradle.launcher.daemon.server.exec.LogAndCheckHealth.execute(LogAndCheckHealth.java:55)
    at org.gradle.launcher.daemon.server.api.DaemonCommandExecution.proceed(DaemonCommandExecution.java:122)
    at org.gradle.launcher.daemon.server.exec.LogToClient.doBuild(LogToClient.java:62)
    at org.gradle.launcher.daemon.server.exec.BuildCommandOnly.execute(BuildCommandOnly.java:36)
    at org.gradle.launcher.daemon.server.api.DaemonCommandExecution.proceed(DaemonCommandExecution.java:122)
    at org.gradle.launcher.daemon.server.exec.EstablishBuildEnvironment.doBuild(EstablishBuildEnvironment.java:82)
    at org.gradle.launcher.daemon.server.exec.BuildCommandOnly.execute(BuildCommandOnly.java:36)
    at org.gradle.launcher.daemon.server.api.DaemonCommandExecution.proceed(DaemonCommandExecution.java:122)
    at org.gradle.launcher.daemon.server.exec.StartBuildOrRespondWithBusy$1.run(StartBuildOrRespondWithBusy.java:50)
    at org.gradle.launcher.daemon.server.DaemonStateCoordinator$1.run(DaemonStateCoordinator.java:295)
    at org.gradle.internal.concurrent.ExecutorPolicy$CatchAndRecordFailures.onExecute(ExecutorPolicy.java:63)
    at org.gradle.internal.concurrent.ManagedExecutorImpl$1.run(ManagedExecutorImpl.java:46)
    at org.gradle.internal.concurrent.ThreadFactoryImpl$ManagedThreadRunnable.run(ThreadFactoryImpl.java:55)
Caused by: org.gradle.api.tasks.TaskExecutionException: Execution failed for task ':app:compileDebugJavaWithJavac'.
    at org.gradle.api.internal.tasks.execution.ExecuteActionsTaskExecuter.executeActions(ExecuteActionsTaskExecuter.java:100)
    at org.gradle.api.internal.tasks.execution.ExecuteActionsTaskExecuter.execute(ExecuteActionsTaskExecuter.java:70)
    at org.gradle.api.internal.tasks.execution.OutputDirectoryCreatingTaskExecuter.execute(OutputDirectoryCreatingTaskExecuter.java:51)
    at org.gradle.api.internal.tasks.execution.SkipUpToDateTaskExecuter.execute(SkipUpToDateTaskExecuter.java:62)
    at org.gradle.api.internal.tasks.execution.ResolveTaskOutputCachingStateExecuter.execute(ResolveTaskOutputCachingStateExecuter.java:54)
    at org.gradle.api.internal.tasks.execution.ValidatingTaskExecuter.execute(ValidatingTaskExecuter.java:60)
    at org.gradle.api.internal.tasks.execution.SkipEmptySourceFilesTaskExecuter.execute(SkipEmptySourceFilesTaskExecuter.java:97)
    at org.gradle.api.internal.tasks.execution.CleanupStaleOutputsExecuter.execute(CleanupStaleOutputsExecuter.java:87)
    at org.gradle.api.internal.tasks.execution.ResolveTaskArtifactStateTaskExecuter.execute(ResolveTaskArtifactStateTaskExecuter.java:52)
    at org.gradle.api.internal.tasks.execution.SkipTaskWithNoActionsExecuter.execute(SkipTaskWithNoActionsExecuter.java:52)
    at org.gradle.api.internal.tasks.execution.SkipOnlyIfTaskExecuter.execute(SkipOnlyIfTaskExecuter.java:54)
    at org.gradle.api.internal.tasks.execution.ExecuteAtMostOnceTaskExecuter.execute(ExecuteAtMostOnceTaskExecuter.java:43)
    at org.gradle.api.internal.tasks.execution.CatchExceptionTaskExecuter.execute(CatchExceptionTaskExecuter.java:34)
    at org.gradle.execution.taskgraph.DefaultTaskGraphExecuter$EventFiringTaskWorker$1.run(DefaultTaskGraphExecuter.java:248)
    at org.gradle.internal.progress.DefaultBuildOperationExecutor$RunnableBuildOperationWorker.execute(DefaultBuildOperationExecutor.java:336)
    at org.gradle.internal.progress.DefaultBuildOperationExecutor$RunnableBuildOperationWorker.execute(DefaultBuildOperationExecutor.java:328)
    at org.gradle.internal.progress.DefaultBuildOperationExecutor.execute(DefaultBuildOperationExecutor.java:199)
    at org.gradle.internal.progress.DefaultBuildOperationExecutor.run(DefaultBuildOperationExecutor.java:110)
    at org.gradle.execution.taskgraph.DefaultTaskGraphExecuter$EventFiringTaskWorker.execute(DefaultTaskGraphExecuter.java:241)
    at org.gradle.execution.taskgraph.DefaultTaskGraphExecuter$EventFiringTaskWorker.execute(DefaultTaskGraphExecuter.java:230)
    at org.gradle.execution.taskgraph.DefaultTaskPlanExecutor$TaskExecutorWorker.processTask(DefaultTaskPlanExecutor.java:123)
    at org.gradle.execution.taskgraph.DefaultTaskPlanExecutor$TaskExecutorWorker.access$200(DefaultTaskPlanExecutor.java:79)
    at org.gradle.execution.taskgraph.DefaultTaskPlanExecutor$TaskExecutorWorker$1.execute(DefaultTaskPlanExecutor.java:104)
    at org.gradle.execution.taskgraph.DefaultTaskPlanExecutor$TaskExecutorWorker$1.execute(DefaultTaskPlanExecutor.java:98)
    at org.gradle.execution.taskgraph.DefaultTaskExecutionPlan.execute(DefaultTaskExecutionPlan.java:626)
    at org.gradle.execution.taskgraph.DefaultTaskExecutionPlan.executeWithTask(DefaultTaskExecutionPlan.java:581)
    at org.gradle.execution.taskgraph.DefaultTaskPlanExecutor$TaskExecutorWorker.run(DefaultTaskPlanExecutor.java:98)
    ... 3 more
Caused by: org.gradle.api.internal.tasks.compile.CompilationFailedException: Compilation failed; see the compiler error output for details.
    at org.gradle.api.internal.tasks.compile.JdkJavaCompiler.execute(JdkJavaCompiler.java:50)
    at org.gradle.api.internal.tasks.compile.JdkJavaCompiler.execute(JdkJavaCompiler.java:35)
    at org.gradle.api.internal.tasks.compile.NormalizingJavaCompiler.delegateAndHandleErrors(NormalizingJavaCompiler.java:98)
    at org.gradle.api.internal.tasks.compile.NormalizingJavaCompiler.execute(NormalizingJavaCompiler.java:51)
    at org.gradle.api.internal.tasks.compile.NormalizingJavaCompiler.execute(NormalizingJavaCompiler.java:37)
    at org.gradle.api.internal.tasks.compile.CleaningJavaCompilerSupport.execute(CleaningJavaCompilerSupport.java:35)
    at org.gradle.api.internal.tasks.compile.CleaningJavaCompilerSupport.execute(CleaningJavaCompilerSupport.java:25)
    at org.gradle.api.internal.tasks.compile.incremental.IncrementalCompilationFinalizer.execute(IncrementalCompilationFinalizer.java:39)
    at org.gradle.api.internal.tasks.compile.incremental.IncrementalCompilationFinalizer.execute(IncrementalCompilationFinalizer.java:24)
    at org.gradle.api.tasks.compile.JavaCompile.performCompilation(JavaCompile.java:207)
    at org.gradle.api.tasks.compile.JavaCompile.compile(JavaCompile.java:133)
    at com.android.build.gradle.tasks.factory.AndroidJavaCompile.compile(AndroidJavaCompile.java:125)
    at org.gradle.internal.reflect.JavaMethod.invoke(JavaMethod.java:73)
    at org.gradle.api.internal.project.taskfactory.IncrementalTaskAction.doExecute(IncrementalTaskAction.java:46)
    at org.gradle.api.internal.project.taskfactory.StandardTaskAction.execute(StandardTaskAction.java:39)
    at org.gradle.api.internal.project.taskfactory.StandardTaskAction.execute(StandardTaskAction.java:26)
    at org.gradle.api.internal.tasks.execution.ExecuteActionsTaskExecuter$1.run(ExecuteActionsTaskExecuter.java:121)
    at org.gradle.internal.progress.DefaultBuildOperationExecutor$RunnableBuildOperationWorker.execute(DefaultBuildOperationExecutor.java:336)
    at org.gradle.internal.progress.DefaultBuildOperationExecutor$RunnableBuildOperationWorker.execute(DefaultBuildOperationExecutor.java:328)
    at org.gradle.internal.progress.DefaultBuildOperationExecutor.execute(DefaultBuildOperationExecutor.java:199)
    at org.gradle.internal.progress.DefaultBuildOperationExecutor.run(DefaultBuildOperationExecutor.java:110)
    at org.gradle.api.internal.tasks.execution.ExecuteActionsTaskExecuter.executeAction(ExecuteActionsTaskExecuter.java:110)
    at org.gradle.api.internal.tasks.execution.ExecuteActionsTaskExecuter.executeActions(ExecuteActionsTaskExecuter.java:92)
    ... 29 more

Вы знаете, что приведенный выше журнал бесполезен для решения этой проблемы. Нам нужно выполнить команду gradle, чтобы найти более полезную информацию.

Примечание: я использую macOS (10.13) и Android Studio (3.1)

Перейдите в каталог проекта Android, чтобы выполнить команду gradle ниже:

./gradlew assembleDebug --info

Примечание. Если у вас возникли проблемы с правами доступа при выполнении вышеуказанной команды, вы можете использовать ее для решения этой проблемы:

chmod +x gradlew

И тогда я получил это (некоторые несущественные части опущены):

> Task :app:compileDebugJavaWithJavac FAILED
Putting task artifact state for task ':app:compileDebugJavaWithJavac' into context took 0.0 secs.
file or directory '/Users/ifeegoo/workspace/android/android-bluetooth-color-lamp-karma-lighting/app/src/debug/java', not found
Up-to-date check for task ':app:compileDebugJavaWithJavac' took 0.009 secs. It is not up-to-date because:
  Task has failed previously.
All input files are considered out-of-date for incremental task ':app:compileDebugJavaWithJavac'.
Compiling with source level 1.7 and target level 1.7.
Creating new cache for classAnalysis, path /Users/ifeegoo/workspace/android/android-bluetooth-color-lamp-karma-lighting/.gradle/4.4.1/javaCompile/classAnalysis.bin, access org.gradle.cache.internal.[email protected]
Creating new cache for jarAnalysis, path /Users/ifeegoo/workspace/android/android-bluetooth-color-lamp-karma-lighting/.gradle/4.4.1/javaCompile/jarAnalysis.bin, access org.gradle.cache.internal.[email protected]
Creating new cache for taskJars, path /Users/ifeegoo/workspace/android/android-bluetooth-color-lamp-karma-lighting/.gradle/4.4.1/javaCompile/taskJars.bin, access org.gradle.cache.internal.[email protected]
Creating new cache for taskHistory, path /Users/ifeegoo/workspace/android/android-bluetooth-color-lamp-karma-lighting/.gradle/4.4.1/javaCompile/taskHistory.bin, access org.gradle.cache.internal.[email protected]
:app:compileDebugJavaWithJavac - is not incremental (e.g. outputs have changed, no previous execution, etc.).
file or directory '/Users/ifeegoo/workspace/android/android-bluetooth-color-lamp-karma-lighting/app/src/debug/java', not found
Compiling with JDK Java compiler API.
/Users/ifeegoo/workspace/android/android-bluetooth-color-lamp-karma-lighting/app/src/main/java/com/chipsguide/app/colorbluetoothlamp/v2/karmalighting/frags/banner/VideoActivity.java:10: error: package com.android.tedcoder.wkvideoplayer.model does not exist
import com.android.tedcoder.wkvideoplayer.model.Video;
                                               ^
/Users/ifeegoo/workspace/android/android-bluetooth-color-lamp-karma-lighting/app/src/main/java/com/chipsguide/app/colorbluetoothlamp/v2/karmalighting/frags/banner/VideoActivity.java:11: error: package com.android.tedcoder.wkvideoplayer.model does not exist
import com.android.tedcoder.wkvideoplayer.model.VideoUrl;
                                               ^
/Users/ifeegoo/workspace/android/android-bluetooth-color-lamp-karma-lighting/app/src/main/java/com/chipsguide/app/colorbluetoothlamp/v2/karmalighting/frags/banner/VideoActivity.java:12: error: package com.android.tedcoder.wkvideoplayer.view does not exist
import com.android.tedcoder.wkvideoplayer.view.MediaController;
                                              ^
Note: Some input files use or override a deprecated API.
Note: Recompile with -Xlint:deprecation for details.
Note: Some input files use unchecked or unsafe operations.
Note: Recompile with -Xlint:unchecked for details.
35 errors

:app:compileDebugJavaWithJavac (Thread[Task worker for ':',5,main]) completed. Took 0.84 secs.

FAILURE: Build failed with an exception.

* What went wrong:
Execution failed for task ':app:compileDebugJavaWithJavac'.
> Compilation failed; see the compiler error output for details.

* Try:
Run with --stacktrace option to get the stack trace. Run with --debug option to get more log output. Run with --scan to get full insights.

* Get more help at https://help.gradle.org

BUILD FAILED in 2s
15 actionable tasks: 1 executed, 14 up-to-date 

У меня есть наиболее важная информация, потому что один модуль импортирован неправильно, что делает класс не найденным. Итак, я получил его и решил проблему.

Некоторая другая команда gradle:

*clean project
./gradlew clean  

*build project
./gradlew build

*build for debug package
./gradlew assembleDebug or ./gradlew aD

*build for release package
./gradlew assembleRelease or ./gradlew aR

*build for release package and install
./gradlew installRelease or ./gradlew iR Release

*build for debug package and install
./gradlew installDebug or ./gradlew iD Debug

*uninstall release package
./gradlew uninstallRelease or ./gradlew uR

*uninstall debug package
./gradlew uninstallDebug or ./gradlew uD 

*all the above command + "--info" or "--debug" or "--scan" or "--stacktrace" can get more detail information.

Если вы не можете получить достаточно информации с помощью --info, используйте вместо нее --debug / - scan / - stacktrace.

Помните, что чем больше деталей поможет вам решить проблему, тем больше.

Примечание. Команды Gradle действительно мощные, если вы хотите выполнять более сложные операции, особенно о том, как работать с отладкой / выпуском, многоканальными или модулями, перейдите в Android Studio, чтобы проверить окно Gradle, и вы узнаете, как это сделать. Это!





gradle